Patient ID,Obesity,1-(1-enyl-palmitoyl)-2-arachidonoyl-GPE (P-16:0/20:4)*,1-(1-enyl-palmitoyl)-2-docosahexaenoyl-GPE (P-16:0/22:6)*,1-(1-enyl-palmitoyl)-2-palmitoyl-GPC (P-16:0/16:0)*,1-(1-enyl-stearoyl)-2-arachidonoyl-GPE (P-18:0/20:4)*,"1,2-dilinoleoyl-GPC (18:2/18:2)","1,2-dioleoyl-GPC (18:1/18:1)*","1,2-dioleoyl-GPE (18:1/18:1)","1,2-dipalmitoyl-GPC (16:0/16:0)","1,5-anhydroglucitol (1,5-AG)",1-arachidonoyl-GPE* (20:4)*,1-methylhistidine,1-methylnicotinamide,1-myristoyl-2-palmitoyl-GPC (14:0/16:0),1-oleoyl-2-linoleoyl-GPC (18:1/18:2)*,1-oleoyl-2-linoleoyl-GPE (18:1/18:2)*,1-oleoyl-GPG (18:1)*,1-palmitoyl-2-arachidonoyl-GPC (16:0/20:4),1-palmitoyl-2-dihomo-linolenoyl-GPC (16:0/20:3n3 or 6)*,1-palmitoyl-2-docosahexaenoyl-GPC (16:0/22:6),1-palmitoyl-2-eicosapentaenoyl-GPC (16:0/20:5)*,1-palmitoyl-2-linoleoyl-GPC (16:0/18:2),1-palmitoyl-2-oleoyl-GPC (16:0/18:1),1-palmitoyl-2-oleoyl-GPE (16:0/18:1),1-palmitoyl-2-oleoyl-GPG (16:0/18:1),1-palmitoyl-2-oleoyl-GPI (16:0/18:1)*,1-palmitoyl-2-palmitoleoyl-GPC (16:0/16:1)*,1-palmitoyl-2-stearoyl-GPC (16:0/18:0),1-palmitoyl-GPC (16:0),1-palmitoyl-GPG (16:0)*,1-palmityl-2-oleoyl-GPC (O-16:0/18:1)*,1-stearoyl-2-arachidonoyl-GPC (18:0/20:4),1-stearoyl-2-arachidonoyl-GPE (18:0/20:4),1-stearoyl-2-arachidonoyl-GPI (18:0/20:4),1-stearoyl-2-linoleoyl-GPC (18:0/18:2)*,1-stearoyl-2-linoleoyl-GPE (18:0/18:2)*,1-stearoyl-2-linoleoyl-GPI (18:0/18:2),1-stearoyl-2-oleoyl-GPC (18:0/18:1),1-stearoyl-2-oleoyl-GPG (18:0/18:1),1-stearoyl-2-oleoyl-GPS (18:0/18:1),2-piperidinone,3-(4-hydroxyphenyl)lactate (HPLA),3-carboxy-4-methyl-5-propyl-2-furanpropanoate (CMPF),3-hydroxybutyrate (BHBA),3-hydroxybutyrylcarnitine (1),3-methylhistidine,3-methylxanthine,4-acetamidophenol,4-acetamidophenylglucuronide,4-acetaminophen sulfate,"4-androsten-3beta,17beta-diol disulfate (1)",5'- GMP,5-oxoproline,7-methylxanthine,acetylcarnitine (C2),adenosine,alanine,alpha-ketoglutarate,alpha-tocopherol,amoxicillin,AMP,arachidonate (20:4n6),arginine,asparagine,aspartate,azelate (nonanedioate; C9),beta-alanine,betaine,butyrylcarnitine (C4),caffeine,carnitine,catechol sulfate,cholesterol,choline,citrate,citrulline,creatine,creatinine,"cytidine 2',3'-cyclic monophosphate",deoxycarnitine,diisopropanolamine,dimethylglycine,ergothioneine,erythronate*,fumarate,gamma-glutamylglutamine,gluconate,glucose,glutamate,glutamine,"glutathione, oxidized (GSSG)","glutathione, reduced (GSH)",glycerate,glycerol,glycerophosphoglycerol,glycerophosphorylcholine (GPC),glycine,guanidinoacetate,guanine,guanosine,heme,HEPES,histidine,hydroxyproline,hypotaurine,hypoxanthine,inosine,isoleucine,lactate,leucine,lysine,malate,maltose,mannitol/sorbitol,metformin,methyl-4-hydroxybenzoate sulfate,MOPS,myo-inositol,"N6,N6,N6-trimethyllysine",N-acetyl-1-methylhistidine*,N-acetylalanine,N-acetylaspartate (NAA),N-acetylglutamate,N-acetylglycine,N-acetylneuraminate,N-acetylserine,NAD+,N-ethylglycinexylidide,nicotinamide,ornithine,palmitoyl sphingomyelin (d18:1/16:0),palmitoylcarnitine (C16),paraxanthine,p-cresol sulfate,phenol sulfate,phenylacetylglutamine,phenylalanine,phosphate,phosphocholine,phosphoethanolamine (PE),proline,propionylcarnitine (C3),pseudouridine,pyroglutamine*,saccharin,serine,sertraline,spermidine,sphingomyelin,sphingosine,stachydrine,sulfate*,taurine,theobromine,theophylline,threonate,threonine,trigonelline (N'-methylnicotinate),trimethylamine N-oxide,trizma acetate,tryptophan,tryptophan betaine ,tyrosine,urate,urea,uridine,valine,xanthine
MA001,Non-Obese,297254,,175525,118180,68708,347081,255636,35542084,1028530,135685,1100673.6,,4882497,304372,,,463859,,,,2924939,8507342,331549,1383792,324892,4973261,624351,228759,138231,,116713,101989,114820,983323,,185681,594461,,196564,2780486,102920,,501681,119517,4178952.3,,,,,90606,118624,197148,,8031382.5,23187304,6238784,117002,496065,,,1220791,17879846,1638400,2397117,,798471,12641755,,2607145,29657200,,1134917,18731030,265232,3594770,19994072,17002424,149914,1182089,1216057,163741,,537373,85960,54585,,2855900,5897960,9994214,198415,308674,195352,57992,90113,6330980,2557655.3,235843,322144,2798417,426935,,12884352,3238286,,1226224,2080728.1,6529395,2716036,4933983,6032140,968935.1,61926,,,,,1244938,108661,278860,,145372,47728,160309,335573,257206,,24407190,2050507,4426385,570242,,356553,422286,67776,308911,5799164,90464784,10425379,1191419,21214072,601308,76826,2049669,1570914,1160518,,529572,,120033,986027,8195905,9739247,7355359,440271,1395105,1962714,354709,112087,,173092,119691,723816,1572466,2030917,1267049,7417975,255681
MA012,Non-Obese,404238,228874,226996,400634,106221,,182736,22866268,690776,93772,375625,172976,3134819,477123,,136902,635949,312765,157013,,3249191,6931016,122026,487888,73210,2639932,769512,277976,,364864,448068,200497,,2035050,191410,109267,762393,185962,227517,735198,151136,108037,,,,88953,,,,,96891,264092,73081,11017157,40461536,3419516,110431,697146,,,2112475,15647312,1627125,3290406,,1064102,17778220,,6898282.5,43511432,65159,4688321,32616336,757714,3382253,28341900,17302078,159314,1766403,1623700,290306,,779583,139506,,,1541330,9883584,10398710,441936,729134,375413,130972,129211,8177082.5,2494098,246829,393883,4983199,449525,,11290952,1954469.1,37487,999320,2418880,5957278,1225253,4588829,5019481,1917187,223534,988277.9,,,,1512161,83251,295737,,137029,113548,103345,1052044,376713,,94827168,2675011,5087129,1062157,137580,1836002,2137549,45138,205478,5353832,90522840,14807624,1531571,17837056,1132194,109261,3169628,5616942,1026122,,697403,420056,153863,2888473,8670435,13709119,23529642,1377659,1851396.9,2148954,630964,105050,,210442,,413640,2420115,2794383,2000250,,525647
MA019,Non-Obese,211063,,158427,103458,148104,825584,394918,60373072,789299,,732882.1,79604,9363417,1024564.9,293757,238626,642806,,84786,68402,4273012,12189346,301265,1164061,341862,10972977,1779621,223338,123279,161442,189367,,66619,1094850,98215,420556,813455,255834,204448,1054284,,28997,161525,,865443.5,146822,81637152,538095,413556,,221789,182088,119050,12262611,31578934,2456977,111713,676214,,2030711,710820.9,10909856,1173936,1934560,325924,,16395187,,4875734,23759608,59277,504553,22737196,341800,2763078,22612476,7907573,47647,385328,1262865.1,,193732,322877,78128,,,1421053,9095667,8648144,244260,485734,257915,,118704,8655064,1773870,70670,257623,1768481,60862,,9758208,2158877,,135267,746588,5128026,1161951,4756966,4014184,1045566,,87766,,189884,,1356820,,466777,,40064,,,175160,266546,52970,4888340,2280788,2839526,456880,120336,815774,566395,69228,124062,3951400,96927456,7547889,1317210,8391758,497867,92166,634097,2480174,598986,,559180,,49667,1048712,7969532,10924968,48386664,524155,1225026,1271308,412036,145210,,,,,1089151,1458958,433909,4342322,71310
MA020,Non-Obese,417832,113225,266177,366466,230228,973864.1,542531,69504768,905200,84990,524465,88138,3830989.3,996424,309331,523494,920481,262752,184681,,6135918,14402618,437957,2161485,324738,6871817,3029364.3,542904,412528,390994,454303,285918,157247,2464490,125625,393239,1496466,607632,306205,263572,69079,25317,1306438,,,,,,,149934,197770,225086,,16411773,27272154,5116773,135840,656271,,,3170057,18622352,1843116,3375807,,572252,15843050,,,38248408,23780,1183466,18697456,323744,4498439,31371088,12926239,206720,1315774,1046361,226390,629344,451244,120566,,,2982445,10143164,14130196,351406,859216,362947,,108567,7377951.5,2762612,121062,282466,3939016,1378423,,14843539,4062761.8,47711,765575,3305650,7202561,2195841,5616173,6688677,1673738,196475,283802,,130133,,1530004,130612,222602,,142094,44359,410822,1260177,302739,,78099912,2273545,5513529,1024497,99868,,668398,246622,92478,5868431,91162200,13815672,1453604,19676526,952782,107221,1075561,1662081,2198409.8,,863722,195555,312341,167485,8213556,12751617,1563500,,2663981,2492237,,412490,,223402,493443,773089,1570524,1588636,1904764,5681776,346057
MA021,Non-Obese,445378,313832,640541,374855,602155,1255008.8,664352,94240520,953911,99355,1340919,330180,9098480,1836384,534046,756759,1113302,588329,635125,70036,11168349,20377280,720981,2923901,568589,10332398,2750500,808163,579210,563713,498638,235658,143647,4757736,382353,577617,2040569,639917,408028,1958629,118417,237257,,188849,1650965.9,193026,3120954,,,190258,120144,363396,194035,17480162,28811410,11145451,379018,699018.1,,,2597868.3,49481992,3572457,3751506,403592,719088,30956730,,2120974,48926076,229882,1276904,39861384,400992,7810768,62215440,27135668,242255,1233979,1044943,284453,99173,1204033,121915,312049,,5132453,13700860,22116920,1141449,327237,534538,,204714,14718426,3350439,201437,,6134070,2948558,170603,24179144,3424658,121991,2877087,5382314,10995801,5342191,7578235,10764386,2347422,303005,241786,,101937,,2979606,217932,,151395,175997,58615,113189,276706,490346,,40952864,3947437,8715444,1820115,293045,963620,1874427,142976,318737,8351920,96443464,15502708,2220207,40344560,1381551,148196,2341754,1832936,2528018,,1011084,512745,169855,573910,10058159,19029444,36698876,591415,3546388.8,4229242,535735,69821,,834550,889375.9,1637206,2632872,2859036,3637854,13951293,470725
MA026,Non-Obese,371503,,275731,247179,279317,1408746,927996,88410288,511274,128256,267927.6,51475,13677260,1267388,591019,341911,1095100,432608,274392,150248,7021953,20444916,693366,2251502,589788,13482366,3093182,426009,123255,302446,417777,272141,204272,2124503,164457,628778,1684159,569037,309981,,94238,,407958,91050,,175018,,,,28757,157201,214444,131369,9028817,30698484,4422566,166617,643532,,,1507923,16631930,1211188,2351199,,466281,10739218,,678034,26914320,34787,1048439,16595005,310733,2612986,17868712,9408509,206667,539552,629787,,,584982,93962,,,1940425.9,8265389,7822288,176358,488169,237832,,133917,5832908,1928343,92297,261993,3628683,811606,,9998953,1591719,32120,490782,1654683,5316622,1296019,4572837,4419238,1078547,122496,418158,,,,1379280,,33770,,362678,,,359877,266765,,30930706,3078193,3024282,926305,119284,173314,625352,55725,263784,4607530,93229336,9100265,1357770,14510339,618209,71594,1603075,348600,763109.9,,581190,218754,214628,1654086,8039972,9779960,35163048,193955,1673609,1232324,222709,80022,,155571,201717,573088,1002968,736482,946200,5096368,138755
MA030,Non-Obese,382470,208375,400029,236462,227315,1058553,497048,82735720,345272,78079,545236,,12555491,945631,367295,410375,1044408,356996,328450,215605,4576046,15700819,435008,1927949.9,348677,12650719,2504140,263168,244567,487273,492997,362790,139123,1593473,219262,429634,1294597,353855,233006,414570,75620,41887,1074354,184364,,42882,,,,,92889,236433,,13108184,31578732,4509381,171197,472095,,60735,1488730.9,12064668,1249722,1870177,445968,325829,13649936,,5289702,22338018,57733,858167,19688612,284504,3167297,8839112,12071875,82711,675095,675685,141790,127946,730393.9,120498,,,2186035,5235320,9117685,247130,51959,431021,91905,116745,4211531,1913039.9,,,2668107,170658,,11243470,1188208,,638823,827557,6117190.5,2371652,4508879,3620260,987292,43770,131439,,,,1542389,,,97911,1605830,,333182,184640,319918,,14678612,2195216,3487070,700784,201250,708286,133666,74196,,5105374,93104144,6650894,994158,17290488,641767,111429,1274587,,966032,,392717,382379,64224,1400920,7955677,7021881,10451626,686799,2060911,605791,941114,122995,,115021,523879,380668,1326932,1590640,739336.1,10279441,78744
MA031,Non-Obese,433834,245163,712248,387639,672794,3329894,1359813,136296352,990996,105604,1643313,,13614466,2560108,736388,1113198,1555960,551980,729610,209675,10408925,35573544,766156,5156445,326391,15355197,5903875,604337,288373,898765,794732,429460,357214,4314385,359547,540314,3898440,2106729,496238,,76676,120848,1222943,278064,1266753.3,64530,,,,83530,184319,1231875,42462,17555900,32399384,7125428,235179,1091119,,,3963935.8,28975640,3137388,4038672,330254,732245,22303990,,2672128,47475960,104662,5531421,23212372,381659,6701103,48693184,16311494,167688,1712150,457559,,220093,821990.9,201021,206768,,4041207,16767388,20626080,529725,547481,500588,,268690,13160488,3083352.8,186604,275530,4840750,689919,,18745776,2498014,110480,517358,5353436,7163057,9951010,6121385,8069041,7185089,109175,226444,,19855,,2909388,112968,173486,149485,2887947,45936,186908,86711,483449,,17055476,3374757,6579946,1122494,218686,265127,594235,146861,183636,6561068.5,95579240,12970017,2485759,28648904,1279288,156662,2237402,,1605284,,951947,584365,71334,13023867,8813283,12874246,10758783,374934,3791964.3,2693046,1164390,135307,,201013,685229,1130760,1308759,3040102,7240818,11748578,2366252
MA033,Non-Obese,263290,85672,209686,193963,255710,1064049.1,461486,65620916,646762,,1221761.8,151997,10373332,1006999,367888,215986,1176431,364820,263935,,6549382,15471044,388096,1163594,265103,7959870,2220762,382211,238409,,639530,263332,59050,2396040,158113,267872,1234933,196686,166663,,64720,75077,,,1654921.3,59020,,,,88538,,361027,46877,12169934,52497972,9678552,207692,867902,,53784,1643844,21611010,1995421.9,2962810,452015,177735,15286373,,3217760,40564048,51669,1915757,16226131,482166,6371925,27976252,20193808,150722,1499523,1422645,,,593269,87682,266026,,3163087.8,12156177,17755178,699460.1,61516,270649,115074,96431,7270379,2693925.3,239753,300628,2788067,441137,,19210404,2202207,44160,518177,1156691,9036479,4417503,6946971,7281141,1698322,114522,,,54187,,1411371,95470,315559,107416,102168,,,358078,331425,,12765035,1971480.1,6036655,804271,92710,538773,1420857,209985,124615,7016957.5,99411224,11756717,1377866,32845564,1239525,99100,3222097,2284724,1329268,,661799,,,3417937,10803047,12385054,7171271.5,352669,1231983,2431845,596184,,,440265,,1458664,3007779,2521703,935095.1,3675576,168535
MA034,Non-Obese,538211,157619,777487,391984,340603,1291644,649856,89727032,184774,87308,128588,,8414566,1252499,445792,246927,1277725,354706,263713,,6481427,18505652,476391,2342351,341247,10977044,2854444,396376,206918,730674.1,487410,451239,130690,1866893,188885,352370,1514601,384020,225562,,67847,,521850,417435,,61489,,,,,153702,235072,36693,12606432,59202636,2431430,126852,885664,,79570,1776849,8645165,969464.9,2486614,322516,,20047728,,1195354,19782200,,1745321,14404591,478784,1154729,15723728,6577873,125222,924584.9,618324,,51019,544044,,,,510395,9814826,5969359,170520,462690,214431,,141996,8799810,2054416,,378300,3474383.8,61313,,7348295,1128382,,,848927,4555879,893635,4893156,2970222.8,1158188,84209,,,,,1479415,,291385,,256854,,126497,153898,300690,103206,25749960,2723425,2354405,1009537,335530,302003,416579,106963,,3117110,90273920,9988869,1687018,6944501,587802,,823800,141384,624777,4272186,685982.9,461881,228405,185526,8362230,11301884,8664752,307756,1059105,706909,,,,,,,618415,646128,841628,9242234,41717
MA051,Non-Obese,,,98386,,269432,912035,521924,59857328,709446,,690425.9,176900,8450492,1296891,340005,,369218,,138621,,4942925,10276880,,1266627,187302,6412306,2203342,187430,73722,164961,,,65591,1604597,112992,400744,667208,650536,192099,,99255,,1049578,345223,,45148,,,,,54267,234416,,26930034,48560820,9632906,164324,742191,,191326,585464,22464264,4360631,7639380,246501,765183,19298844,,5042434,97814536,79678,776174.1,17499666,632705,8488580,21588894,14293846,102813,1929048.9,810751,,203931,636683,106117,203570,,3735131,26329172,21818124,500414,945755,504652,430946,229546,13650172,2926728,124019,301623,1516748,78060,,23729512,2478763,179147,421810,1298658,11606664,3008839,9788896,8416938,1444183,103053,,,14960,,1781985,,374458,,67036,74003,207713,195385,355061,74396,7854667.5,2460747,7349024,410357,151643,195613,344466,106877,82821,8769345,90217848,17376276,1549392,32617100,1295413,103040,2266230,782303,1991874,,572841,97900,227094,2377404,9049702,16835510,5248388,785306,2398306,2567389,639643,100813,,415942,1387068,1662123.9,2193818,1842193,761810,13514119,118408
MA054,Non-Obese,226274,117945,416298,,526364,852954.3,231217,59771708,1907179,,1499668,237069,7076926.5,1296947,369216,,581765,228517,307404,136787,6129005,12585765,275626,1025400.9,220320,6265423,2619806,350226,120324,623541,255492,,80735,2218227.5,217976,387075,1002856.9,,165162,,114815,186124,2481477,577505,,69335,,,,,,516879,33998,45576164,57229084,12857552,186234,547082,,212499,406864,33104370,6103804.5,9502970,676529,1212480,29868068,567774,2096911,108718712,80999,608719,16686760,674633,9871473,33882300,28560976,,3185393,725663,314481,101844,937153,114312,406031,,7647330,33019100,32963286,889349,404665,936993,,106986,20671614,5937569,397894,285078,1866110,,,37790744,3075747,422920,451655,1149532,15220030,4030189,12424560,14191079,2010756,86144,,,112173,,2000683.1,190910,149076,106887,68078,65243,219732,,393512,127506,6723557,2184230,10151364,572813,229204,358897,910520,175903,351157,11482092,93468728,23598924,1619635,40021592,2892032,102279,1969613.1,3965860.8,4137573,,567040,297589,76745,2413161,9975490,18064484,5865707,404356,3868254.8,5911636,1132748,134109,,639108,384842,2037667,2926039,2368512,902205,15371855,124873
MA055,Non-Obese,277562,74084,346374,204581,194523,1384263,530436,75708712,2046324,,1066877,90987,8505996,1113469,414346,681058,1053206,294507,126234,,4686785,14752430,370079,2380671,197484,10855251,2215365,239060,351800,420122,395645,263453,124729,1152594,173720,377782,1140336,739429,259678,,94883,,1058348,192474,1354956.5,100936,,,,,,307614,,20894678,55926820,11063103,185952,721928.1,,,1545431,35213048,5170270,5615634.5,476494,628976,25383576,,29889116,60749044,40549,594678,25984936,719507,8951111,36601316,16022659,140135,1243644,1108940,207164,225523,1007921,83346,403112,,5423757,18474720,33802520,638112,683001,702052,,119283,8108519.5,5028399,355535,347644,6735157,212856,,30221056,2877446,177022,440171,2949728,12854311,3495220,10070205,12417600,1819210,127448,226934,,,,2055347,214949,201717,119036,100335,59742,212648,259134,356554,,18112258,4221378,9386561,629310,245322,1782288.1,739869,83801,397292,9351123,90480232,13836217,2115516,39675696,1898581,166279,1303068,773385,3749272,,1110657,227407,,953067,9995417,17046266,35394052,2078130,2210669,5063459,1331880,132639,,492433,837177.1,2298930,2506707,2581236,2377264,15295855,215120
MA056,Non-Obese,381572,130814,390533,197902,,586271,397400,43506616,1366840,,,52381,8089683,440955,122948,,374268,122187,140434,,3031908,11265204,329623,1155888,334666,6714757,807833,232030,146109,701007,97601,191605,,758892,,300615,825198,305977,144054,1183008,52657,,275038,203588,,,,,,,26305,109072,,4038621,23545390,1694035.9,,560583,,167332,359444,9256650,727160,1088280,300857,,6799430,,3369511.3,11152143,,646267.9,18807132,248574,2562115,16493866,8290372.5,,368191,1671865,,,356312,,,,1423873,3719408,5049992,,130878,185979,,,4109630.8,1156681,,484209,930493.9,,,7437287.5,869296,,262673,243834,3482358,2718554,4385154,2804938,577465,,,,,,1091456,,127819,70309,108511,,,,259612,,52662908,1743823,2125468,647277,535722,349507,610640,32288,286583,3170799,92735096,4892748,728049,10553417,513601,95034,237588,,604897,,300997,490546,65644,1254826,8567059,5522587,5970668,746288,955166,765844,216007,256137,,,,,610483,1981629,283732,2708368,
MA057,Non-Obese,150610,95736,124725,,,636142,259456,45945872,2366562,,2780360,221864,4701640,774588,126112,939469,581684,202797,308524,226483,4358466,9793112,232458,2659476,314420,7478950,1063660,188082,940143,263143,244948,126224,638707,1385642,,212490,549696,,597549,22681732,108810,248969,334791,319447,6217301,,,,,,,237248,,16138574,45018776,12148623,188046,895783.1,,,1396425.9,28748798,3495617,2842357,424417,,27086240,,2303836,63724872,130840,1998461,29160360,781759,8941188,25860428,27738366,,996285,1595257,319905,253875,1081401,303374,363768,,5893984,9142662,25051186,513812,448522,1126214,,127942,6436955,3451344,201242,289250,2822948,,,25991334,3606469.8,,780063,1844893,9807533,3438900,8428909,13186652,1376650,156281,152909,,19619,,3565338.8,,235977,113544,5465519,,196751,318820,383768,,13790111,3238487,8195374,404471,155664,241577,538138,284575,324766,8372140.5,92088280,10959354,1378720,39579728,972793,115577,5932656,729904,1597928,,775418.9,,60258,5495854,10183435,13810071,3124103,232300,4461874,3412221,570515,237741,,239695,,1687858,4203495,4882156,1490757,7093373,185879
MA002,Obese,276560,110812,181153,426109,181150,794633.8,529942,48888076,2070371.1,,1069576,90270,6227045,1152924,346335,308554,2331881,1172997,604581,219138,10909686,16326775,514897,2660898,389398,11045269,963745.9,908120,295796,316435,1641871.9,350025,189189,5561657.5,218011,420356,1687709,601914,271497,901936,137274,170938,696718,,,91442,,,,480260,53086,284832,69103,9882440,12379697,11678635,282601,1229707,,,4500316,38610728,2703647,3653062,,496102,12334769,,,33703712,75870,25758792,34320184,426424,7055848.5,43904924,24906902,147913,890340,1208963,414469,,1312711,106424,220991,,6395906,13422809,19425098,534561,46928,487648,6101579,154032,7025931,3501087.3,235174,113549,2341614,1441366,,19237954,4152122,27703,1792417,3640276,12496547,4783138,10581928,11411630,1403023,106624,119357,,79065,,1876706,236007,,113021,605626,,237216,152558,456761,,7695060.5,3486394,8658745,2629033,98509,,701407,118064,129593,12607544,93754624,6950291,1260047,39180784,960883,227105,3033331.3,,1407711,,377440,614392,49449,278281,9856393,12697329,11952517,186487,2548811,2566748,446472,,,1275281,502076,2334395,3677094,3314315,1823278,14326592,334186
MA006,Obese,,,,,,452333,170187,38799040,872312,,963069.1,113676,3112221,282825,185271,,319643,76927,,,2438106,8015396,252233,942722,380807,7946011,508504,109305,,,,,,561871,,301993,325010,115281,123523,449354,79637,,3670351,1282845,1380868,,456911456,206433,361980,,93081,405509,,17370250,20851548,4978682.5,167747,558932,,1181150,502531,19118392,2217223,2661332.3,,445233,8684872,,394420,24075136,,428336,8596755,636599,6458210.5,23084126,12295613,,706581,1772547,,40425,746099,,150981,797062,3906745,10226790,17181866,243558,162035,344497,2522299,87864,7052192,2908921,197902,363259,400484,103943,,16453481,2322018,,309862,355684,9525833,2806577,6857030,7943786,1280604,76419,12173911,,29389,,1450955,,206446,96885,48727,67662,168707,,333774,66383,1525096,2261177,6112399,253901,,,261821,93121,78910,6279414,91339320,5215105,1054277,27037748,514296,68273,1331186,,2088053,,581328,,98485,491585,9334184,8834300,1468420,117509,1123965,2234653,312544,109865,,263401,154222,719657,2714700,1289827,351133,1256213,115091
MA022,Obese,407137,,,192327,59141,1180938,761343,70957696,749623,58738,1087640.8,67485,6141189,688136,423067,260079,1902517,719338,606568,166534,7466851.5,20024700,792020.1,2109520,744451,15261380,904250,374969,378582,257004,576389,290845,143522,1689417.9,,531730,981779,227406,154298,1044032,74602,,1283580,724758,722042.2,,,,,76458,268089,301987,,17690804,12418826,5107359.5,218579,332006,,4502600,2160917,26624972,1787434,4326995,,701974,9147271,,,25954850,,706513,18071236,331756,3690407.3,40543160,11702232,138401,414726,1217526,309266,177335,762196,148582,114928,7172861,3737548,12172764,12641231,648710,355867,233713,,101399,7133585,2794868.8,,379409,410038,2682424,,17125558,1594138,70074,1262233,636859,12300792,1809860,11902579,8116210,1328831,,134463,,58547,,1967192,92770,,98896,61277,,199723,,298354,,18575308,4714558,4634986,1217379,137740,,374045,909931,,7099833,90710120,8219007,1543669.9,21352248,910385,103032,1059570,,1525633,,880658.1,329294,102671,369336,8382739,12933990,983220.9,118010,1835481,2081129,,359065,,307588,412494,933893.9,2491090,1851256,676355,14478612,219168